Joguet per funció
type: Concept
broader: Joguet
preferred label: Juguete por función @es
preferred label: Toys by function @en

Artefacte recreatiu
type: Concept
narrower: Joguet
preferred label: Artefacto recreativo @es
preferred label: Recreational artifact @en

Joguet per forma
type: Concept
broader: Joguet
preferred label: Juguete por forma @es
preferred label: Toys by form @en

Joguets per funcionament
type: Concept
broader: Joguet
preferred label: Juguete por funcionamiento @es
preferred label: Toys by mode of operation @en

Joguet
type: Concept
alternative label: joguina
broader: Artefacte recreatiu
definition: Del dim. de juego. Objeto material creado para la diversión de niños y mascotas o para colección. Los juguetes son, por lo general, versiones en miniatura de seres u objetos reales que se prestan al juego imaginativo o imitativo. También pueden ser artículos para usar en juegos. Los primeros juguetes en ser usados fueron muñecas y pelotas. @es
definition: De joc1 1a font: 1653, DTo. Objecte material creat per a la diversió de xiquets i mascotes o per a col·lecció. Els joguets són, en general, versions en miniatura d'éssers o objectes reals que es presten al joc imaginatiu o imitatiu. També poden ser articles per a usar en jocs. Els primers joguets a ser usats van ser nines i pilotes.
definition: Material objects contrived for amusement rather than for practical use by children or pets, or intended as collectibles by adults. Toys are generally miniature versions of real beings or objects that lend themselves to imaginative or imitative play. Toys may also be items for use in games. Among the earliest toys were dolls and balls. @en
in scheme: Objectes
narrower: Joguets per funcionament
narrower: Joguet per funció
narrower: Joguet per forma
preferred label: Juguete @es
preferred label: Toy @en

Objectes
type: ConceptScheme
preferred label: Objetos @es
preferred label: Objects @en