Vivienda
type: Concept
narrower: Cocina (espacio)

Cocina (espacio)
type: Concept
broader: Vivienda
definition: Del lat. coqu?na, de coqu?re 'cocer'. Habitaciones destinadas a la preparación y la cocción de alimentos.
definition: del ll. vg. td. coc?na, ll. vg. coqu?na, íd., der. de coquus cuiner i substitut del ll. cl. cul?na, base de cultismes com culinari; a través del cat. ant. coïna. Estança destinada a la preparació i la cocció d'aliments. @ca
definition: Rooms for the preparation and cooking of food. @en
in scheme: Objetos
preferred label: Cuina (espai) @ca
preferred label: Kitchen @en

Objetos
type: ConceptScheme
preferred label: Objectes @ca
preferred label: Objects @en