Acabado
type: Concept
narrower: Pulido
preferred label: Acabat @ca
preferred label: Finish @en

Pulido
type: Concept
alternative label: pulimentado
broader: Acabado
definition: Del part. de pulir; lat. pol?tus. Proceso de frotar una superficie para dejarla lisa o brillante.
definition: Procés de fregar una superfície per a deixar-la llisa o brillant. @ca
definition: Process of rubbing a surface to make it smooth or shiny. @en
in scheme: Actividades
preferred label: Poliment @ca
preferred label: Polishing @en

Actividades
type: ConceptScheme
preferred label: Activitats @ca
preferred label: Activities @en