Pantalla
type: Concept
broader: Difusor
definition: Quizá del cat. pantalla, y este cruce de pàmpol 'pantalla de lámpara' y ventalla 'pantalla de lámpara'. Dispositivos colocados sobre o alrededor de la fuente de luz de una lámpara, diseñados para luz difusa o directa y el evitar resplandor. Pueden diseñados para realizar una tarea o para ser principalmente decorativos. @es
definition: Probablement alteració de ventalla per influx de pàmpol. Dispositius col·locats sobre o al voltant de la font de llum d'un llum, dissenyats per a llum difusa o directa i l'evitar resplendor. Poden dissenyats per a fer una tasca o per a ser principalment decoratius.
definition: Devices for redirecting or scattering light from a source, mainly by the process of diffuse transmission. @en
in scheme: Objectes
preferred label: Lampshade @en

Difusor
type: Concept
narrower: Pantalla
preferred label: Diffuser @en

Objectes
type: ConceptScheme
preferred label: Objetos @es
preferred label: Objects @en