Componentes del mobiliario
type: Concept
narrower: Bocallave
preferred label: Components del mobiliari @ca
preferred label: Furnishings components @en

Bocallave
type: Concept
broader: Componentes del mobiliario
definition: Decoración metálica que bordea la zona del ojo de una cerradura.
definition: Decoració metàl·lica que voreja la zona de lull dun pany. @ca
definition: Metal decoration bordering the keyhole area. @en
in scheme: Objetos
preferred label: Forat de pany @ca
preferred label: Keyhole surround @en

Objetos
type: ConceptScheme
preferred label: Objectes @ca
preferred label: Objects @en