Procesos y técnicas por tipo específico
type: Concept
narrower: Procesos y técnicas de protección
preferred label: Processos i tècniques per tipus específic @ca
preferred label: Processes and techniques by specific type @en

Procesos y técnicas de protección
type: Concept
broader: Procesos y técnicas por tipo específico
definition: Conjunto de procesos y técnicas para la conservar y proteger la preservación de la existencia, el estado,la salvaguarda de las influencias destructivas, la decadencia natural o los residuos de los objetos.
definition: Conjunt de processos i tècniques per a la conservar i protegir la preservació de l'existència, l'estat,la salvaguarda de les influències destructives, la decadència natural o els residus dels objectes. @ca
definition: It referst to the set of processes and techniques for the conservation and protection of the preservation of the existence, the condition, the safeguarding from destructive influences, natural decay or residues of objects. @en
in scheme: Actividades
preferred label: Processos i tècniques de protecció @ca
preferred label: Protective processes and techniques @en

Actividades
type: ConceptScheme
preferred label: Activitats @ca
preferred label: Activities @en