Lino
type: Concept
broader: Fibra vegetal
preferred label: Lli @ca
preferred label: Flax @en

Fibra natural
type: Concept
narrower: Fibra vegetal
preferred label: Natural fibre @en

Algodón
type: Concept
broader: Fibra vegetal
preferred label: Cotó @ca
preferred label: Cotton @en

Fibra vegetal
type: Concept
alternative label: fibra celulósica
alternative label: Vegetal fiber @en
broader: Fibra natural
definition: La proveniente de diversos tipos de plantas y por lo tanto de alto contenido celulósico. Para su obtención se pueden utilizar bien las semillas, los tallos o las hojas de las plantas. Las más características son: el algodón que se obtiene de la semilla de la planta del mismo nombre, el lino y el cáñamo, que se obtienen de los tallos de sus respectivas plantas. Pero existen muchas otras fibras de carácter vegetal, pudiendo mencionarse entre otras provenientes de semillas, el coco, el maíz y el kapoc; extraídas del tallo destacan el ramio y el yute; y con origen en las hojas, el sisal y el abacá o cáñamo de Manila. En líneas generales, con las fibras vegetales se pueden producir hilos con los que elaborar textiles ligeros al tiempo que resistentes.
definition: La provinent de diversos tipus de plantes i per tant d'alt contingut cel·lulòsic. Per a la seua obtenció es poden utilitzar bé les llavors, les tiges o les fulles de les plantes. Les més característiques són: el cotó que s'obté de la llavor de la planta del mateix nom, el lli i el cànem, que s'obtenen de les tiges de les seues respectives plantes. Però existeixen moltes altres fibres de caràcter vegetal, podent esmentar-se entre altres provinents de llavors, el coco, la dacsa i el *kapoc; extretes de la tija destaquen el ramio i el jute; i amb origen en les fulles, el sisal i el abacá o cànem de Manila. En línies generals, amb les fibres vegetals es poden produir fils amb els quals elaborar tèxtils lleugers al mateix temps que resistents. @ca
definition: Any fibre from any plant. There are lots of plants that are a source of vegetable fibres. @en
in scheme: Materiales
narrower: Algodón
narrower: Lino
preferred label: Vegetal fibre @en

Materiales
type: ConceptScheme
preferred label: Materials @ca