Lámpara por forma
type: Concept
narrower: Quinqué
preferred label: Làmpada per forma @ca
preferred label: Lamps by form @en

Quinqué
type: Concept
broader: Lámpara por forma
definition: Del fr. quinquet, y este de A. Quinquet, 1745-1803, primer fabricante de esta clase de lámparas. Lámpara de aceite o petróleo con una mecha en su interior que sirve de tiro. Cuenta con una pantalla de vidrio globular que protege la llama. Patentada por Argand en 1783. Más tarde Quinquet la perfecciona y le da su nombre.
definition: Del fr. quinquet, del nom dAntoine Quinquet (1745-1803), farmacèutic francès que perfeccionà aquest llum, inventat pel físic suís Aimé Argand (1755-1803). Llum d'oli o petroli amb una metxa en el seu interior que serveix de tir. Compta amb una pantalla de vidre globular que protegeix la flama. Patentada per Argand en 1783. Més tard Quinquet la perfecciona i li dóna el seu nom. @ca
definition: An oil or petroleum lamp with a wick inside that acts as a draft. It has a globular glass shade to protect the flame. It was patented by Argand in 1783. Quinquet later perfected it and gave it his name. @en
in scheme: Objetos
preferred label: Globe lamp @en

Objetos
type: ConceptScheme
preferred label: Objectes @ca
preferred label: Objects @en