Objetos
type: ConceptScheme
preferred label: Objectes @ca
preferred label: Objects @en

Parchís
type: Concept
broader: Juego de mesa y tablero
definition: Juego de tablero de la India para cuatro jugadores en parejas en donde dos piezas del juego se mueven alrededor de una pista en forma de cruz. Los movimientos son determinados por tiros de caracoles o dados, y cada jugador comienza con cuatro piezas, en el centro y se mueve hacia abajo a la derecha en dirección de los minuteros del reloj; el tema central es la lucha alrededor de la pista exterior del tablero. Las parejas cuyas piezas son completadas primeramente en la via por volver al espacio de centro es la ganadora.
definition: Joc de tauler de l'Índia per a quatre jugadors en parelles on dos peces del joc es mouen al voltant d'una pista en forma de creu. Els moviments són determinats per tirs de caragols o daus, i cada jugador comença amb quatre peces, en el centre i es mou cap avall a la dreta en direcció dels *minuteros del rellotge; el tema central és la lluita al voltant de la pista exterior del tauler. Les parelles les peces de les quals són completades primerament en la via per tornar a l'espai de centre és la guanyadora. @ca
definition: Indian board game for four players in opposing partnerships of two in which game pieces are moved around a cross-shaped track. Moves are determined by throws of cowrie shells or dice, and each player begins with four pieces, at the center and moves down the middle track counter clockwise around the outer track of the board. The partnership whose pieces first complete the course by returning to the centre space is the winner. @en
in scheme: Objetos
preferred label: Parxís @ca
preferred label: Parchisi @en

Juego de mesa y tablero
type: Concept
narrower: Parchís
preferred label: Joc de taula i tauler @ca