Objetos
type: ConceptScheme
preferred label: Objectes @ca
preferred label: Objects @en

Pata de lira
type: Concept
broader: Pata
definition: Soporte que se dispone de manera lateral, con perfil recortado en forma de lira, más ancho en la parte inferior que en la superior. En Cataluña y Baleares generalmente tienen un montante vertical intermedio a modo de parteluz. Es de origen italiano.
definition: Suport que es disposa de manera lateral, amb perfil retallat en forma de lira, més ample en la part inferior que en la superior. A Catalunya i Balears generalment tenen un muntant vertical intermedi a manera de trencallums. És d'origen italià. @ca
definition: It refers to a lyre- shaped leg that is arranged laterally. It is wider at the bottom than at the top. In Catalonia and the Balearic Islands they generally have an intermediate vertical mullion as a mullion. It is of Italian origin. @en
in scheme: Objetos
preferred label: Petge de lira @ca
preferred label: Lyre leg @en

Pata
type: Concept
narrower: Pata de lira
preferred label: Petge @ca
preferred label: Leg @en