Objetos
type: ConceptScheme
preferred label: Objectes @ca
preferred label: Objects @en

Western
type: Concept
broader: Juguete por forma
definition: Juguetes generalmente de tamaño pequeño, de plástico o resina compuestos de dos bandos enfrentados que servían para recrear la conquista del Oeste de Norte América.
definition: Joguet generalment de grandària xicoteta, de plàstic o resina compostos de dos bàndols enfrontats que servien per a recrear la conquesta de l'Oest de Nord Amèrica. @ca
definition: Toys generally of small size, made of plastic or resin, composed of two opposing sides that served to recreate the conquest of the West of North America. @en
in scheme: Objetos

Juguete por forma
type: Concept
narrower: Western
preferred label: Joguet per forma @ca
preferred label: Toys by form @en