Objetos
type: ConceptScheme
preferred label: Objectes @ca
preferred label: Objects @en

Cartera
type: Concept
broader: Contenedores de uso personal
definition: De cartero. Objeto de forma cuadrangular hecho de cuero u otra materia generalmente flexible, con asa para llevarlo y que puede contener documentos, papeles, libros, etc.
definition: Objecte de forma quadrangular fet de cuir o una altra matèria generalment flexible, amb ansa per a portar-ho i que pot contindre documents, papers, llibres, etc. @ca
definition: Quadrangular-shaped object made of leather or another generally flexible material, with a handle for carrying it and which can contain documents, papers, books, etc. @en
in scheme: Objetos
preferred label: Clutch bag @en

Contenedores de uso personal
type: Concept
narrower: Cartera
preferred label: Contenidors d'ús personal @ca
preferred label: Containers for personal use @en