Actividades
type: ConceptScheme
preferred label: Activitats @ca
preferred label: Activities @en

Tallado
type: Concept
broader: Procesos y técnicas sustractivas
definition: Del part. de tallar. Técnica de conformación o de decoración que consiste en sustraer fragmentos de manera progresiva de un bloque inicial de materia, hasta la aparición del objeto o de los motivos decorativos a realizar
definition: Tècnica de conformació o de decoració que consistix a sostraure fragments de manera progressiva d'un bloc inicial de matèria, fins a l'aparició de l'objecte o dels motius decoratius a realitzar. @ca
definition: Shaping or decorative technique consisting of progressively removing fragments from an initial block of material until the object or decorative motifs to be produced appear. @en
in scheme: Actividades
preferred label: Tallat @ca
preferred label: Carving @en

Procesos y técnicas sustractivas
type: Concept
narrower: Tallado
preferred label: Processos i tècniques de sostracció @ca
preferred label: Subtractive processes and techniques @en