Objectes
type: ConceptScheme
preferred label: Objetos @es
preferred label: Objects @en

Làmpara de taula de nit
type: Concept
alternative label: Làmpada de taula de nit
broader: Làmpada de taula
definition: Pequeñas lámparas de metal o vidrio frecuentemente con una base de platillo ideadas para ser usada en el dormitorio. @es
definition: Xicotets llums de metall o vidre sovint amb una base de platet ideades per a ser usada en el dormitori.
definition: Small metal or glass lamps frequently with a saucer base meant for use in the bedchamber. @en
in scheme: Objectes
preferred label: Lámpara de mesa de noche @es
preferred label: Chamber lamps @en

Làmpada de taula
type: Concept
narrower: Làmpara de taula de nit
preferred label: Lámpara de mesa @es
preferred label: Table lamp @en