Objetos
type: ConceptScheme
preferred label: Objectes @ca
preferred label: Objects @en

Canapé góndola
type: Concept
broader: Canapé
definition: Canapé de planta oval o arriñonada, con respaldo y brazos trazados por una sola curva desdendente, que a veces avanza ligeramente, cerrándose sobre el frente
definition: Canapè de planta oval o en forma de renyo, amb respatler i braços traçats per una sola corba desdendente, que a vegades avança lleugerament, tancant-se sobre el front. @ca
definition: Canapè with an oval or kidney-shaped base, with a back and arms traced by a single slanting curve, which at times advances slightly, sometimes tapering over the front. @en
in scheme: Objetos
preferred label: Canapè góndola @ca
preferred label: Canapé gondole @en

Canapé
type: Concept
narrower: Canapé góndola
preferred label: Canapè @ca