Objetos
type: ConceptScheme
preferred label: Objectes @ca
preferred label: Objects @en

Lavabo (aparato sanitario)
type: Concept
broader: Mobiliario de baño e higiene
definition: Del lat. lavabo [inter innocentes manus meas] 'lavaré [mis manos entre los inocentes]', palabras del salmo 26 que pronunciaba el sacerdote mientras se lavaba las manos antes de la consagración, de las cuales la primera acabó designando el recipiente en que lo hacía. Recipiente tipo pila o mueble con recipiente para agua, que se emplea para el lavado personal. A veces consta de compartimentos o soportes adecuados para depositar los objetos de aseo: toallero, jabonera, porta esponjas, etc. Actualmente, pila con grifos y otros accesorios que se utiliza para lavarse.
definition: Del *ll. lavabo rentare, 1a pers. sing. del futur de llavara rentar, tret del salm 25, Lavabo inter innocentes manus pixes em rentaré les mans entre els innocents, recitat pel sacerdot al moment de rentar-se les mans a la missa. Recipient tipus pila o moble amb recipient per a aigua, que s'empra per a la rentada personal. A vegades consta de compartiments o suports adequats per a depositar els objectes d'higiene: tovalloler, sabonera, porta esponges, etc. Actualment, pila amb aixetes i i altres accessoris que s'utilitza per a llavar-se. @ca
definition: Basins connected with a drain and usually a water supply for washing and drainage. @en
in scheme: Objetos
narrower: Lavabo (de pie)
narrower: Porta lavabo
narrower: Lavatorio
narrower: Fregadero
preferred label: Lavabo (aparell sanitari) @ca
preferred label: Sinks (fixtures) @en

Mobiliario de baño e higiene
type: Concept
narrower: Lavabo (aparato sanitario)
preferred label: Mobiliari de bany i higiene @ca
preferred label: Bathroom furnishing and hygiene @en

Lavabo (de pie)
type: Concept
broader: Lavabo (aparato sanitario)
preferred label: Lavabo (de peu) @ca
preferred label: Basin stand @en

Porta lavabo
type: Concept
broader: Lavabo (aparato sanitario)

Lavatorio
type: Concept
broader: Lavabo (aparato sanitario)

Fregadero
type: Concept
broader: Lavabo (aparato sanitario)