Objetos
type: ConceptScheme
preferred label: Objectes @ca
preferred label: Objects @en

Enllumenat d'emergència
type: Concept
alternative label: Alumbrado de emergencia
broader: Artefactos de iluminación por función
definition: Sistemas de iluminación de edificios que suministran iluminación esencial para la seguridad personal y la propiedad, en el evento de falla del suministro normal.
definition: Sistemes d'il·luminació d'edificis que subministren il·luminació essencial per a la seguretat personal i la propietat, en l'esdeveniment de falla del subministrament normal. @ca
definition: Building lighting systems that supply illumination essential to the safety of life and property in the event of failure of normal supply. @en
in scheme: Objetos
preferred label: Emergency lighting @en

Artefactos de iluminación por función
type: Concept
narrower: Enllumenat d'emergència
preferred label: Artefacte d'il·luminació per funció @ca
preferred label: Lighting devices by function @en