Actividades
type: ConceptScheme
preferred label: Activitats @ca
preferred label: Activities @en

Remachado
type: Concept
broader: Unión
definition: Del part. de remachar. Formación de una conexión permanente entre dos o más piezas de material por el paso de un remache a través de los orificios alineados.
definition: Formació d'una connexió permanent entre dos o més peces de material pel pas d'un rebló a través dels orificis alineats. @ca
definition: Forming a permanent connection between two or more pieces of material by passing a rivet through aligned holes. @en
in scheme: Actividades
preferred label: Reblat @ca
preferred label: Riveting @en

Unión
type: Concept
narrower: Remachado
preferred label: Unió @ca
preferred label: Join @en