Objetos
type: ConceptScheme
preferred label: Objectes @ca
preferred label: Objects @en

Ducheses brisée
type: Concept
broader: Duquesa
definition: This word is used when the chaise longue is divided in two parts: the chair and a long footstool, or two chairs with a stool in between them.[5] The origin of the name is unknown. @en
in scheme: Objetos

Duquesa
type: Concept
narrower: Ducheses brisée
preferred label: Duquessa @ca
preferred label: Duchesse @en