Objects
type: ConceptScheme
preferred label: Objetos @es
preferred label: Objectes @ca

Braid
type: Concept
alternative label: galon
broader: Passementerie
definition: Del fr. galon. Tejido fuerte y estrecho, a manera de cinta, que sirve para guarnecer prendas de vestir, colgaduras, tapicerías y en general cualquier obra textil. Antiguamente se denominó esterilla. @es
definition: Del *fr. *galon. Teixit fort i estret, a manera de cinta, que serveix per a guarnir peces de vestir, teles de penjar, tapisseries i en general qualsevol obra tèxtil. Antigament es va denominar estoreta. @ca
definition: n. From the Old English "brægd" "br?d" and the Middle English "breid" "braid". It is a narrow flat, round or tubular band fabric made with threads of silk, wool, cotton, gold or silver. It is used for trimming or binding articles of dress.
in scheme: Objects
preferred label: Galón @es
preferred label: Galó @ca

Passementerie
type: Concept
narrower: Braid
preferred label: Pasamanería @es
preferred label: Passamaneria @ca