Objetos
type: ConceptScheme
preferred label: Objectes @ca
preferred label: Objects @en

Atlante
type: Concept
broader: Elementos de arquitectura
definition: Del pl. lat. Atlantes 'telamones', 'atlantes, antigua nación norteafricana', y este del pl. gr. ????????? Átlantes. Escultura masculina de medio o de cuerpo entero, en pie o en cuclillas que cumple la función de columna en la arquitectura clásica y que fueron imitadas en otros estilos, como en el Renacimiento, Manierismo, Barroco e incluso en el Modernismo. Puede usarse como elemento sustentante o como motivo ornamental. También aparecen encuentran ocasionalmente en muebles del siglo XVI en adelante.
definition: Del ll. Atlas, -ntis (v. atles1) 1a font: 1839, DLab. Escultura masculina de mitjà o de cos sencer, en peus o a la gatzoneta que compleix la funció de columna en l'arquitectura clàssica i que van ser imitades en altres estils, com en el Renaixement, Manierisme, Barroc i fins i tot en el Modernisme. Pot usar-se com a element sustentant o com a motiu ornamental. També apareixen troben ocasionalment en mobles del segle XVI d'ara en avant. @ca
definition: Gr Atlantes, pl. of Atlas. Half- or full-length male sculpture, standing or squatting that fulfills the function of a column in classical architecture and was imitated in other styles, such as Renaissance, Mannerism, Baroque and even Modernism. It can be used as a supporting element or as an ornamental motif. They are also occasionally found in furniture from the 16th century onwards. @en
in scheme: Objetos
preferred label: Atlant @ca

Elementos de arquitectura
type: Concept
narrower: Atlante
preferred label: Elements d'arquitectura @ca
preferred label: Architectural elements @en