Objetos
type: ConceptScheme
preferred label: Objectes @ca
preferred label: Objects @en

Pie de ménsula
type: Concept
broader: Pie
definition: Pies con forma de ménsula, rectos por fuera y recortados en forma de ménsula por dentro. El pie va en dos direcciones desde las esquinas con formas más o menos sencillas.Apareció en la primera mitad del siglo XVIII. Este tipo fue muy ornamentado por Chippendale en Inglaterra, por Goddard y otros en América.
definition: Peus amb forma de mènsula, rectes per fora i retallats en forma de mènsula per dins. El peu va en dues direccions des de les cantonades, amb formes més o menys senzilles. Va aparéixer en la primera meitat del segle XVIII. Aquest tipus va ser molt ornamentat per Chippendale a Anglaterra, per Goddard i altres a Amèrica. @ca
definition: Feet shaped like a bracket, straight on the outside and trimmed in the form of a bracket on the inside. The foot runs two ways from the corners, in more or less simple shapes. It appeared in the first half of the 18th century. The type was highly ornamented by Chippendale in England, by Goddard and others in America. @en
in scheme: Objetos
preferred label: Peu de mènsula @ca
preferred label: Bracket foot @en

Pie
type: Concept
narrower: Pie de ménsula
preferred label: Peu @ca
preferred label: Foot @en