Objetos
type: ConceptScheme
preferred label: Objectes @ca
preferred label: Objects @en

Sopera
type: Concept
alternative label: sopera salsera
broader: Grupo de elementos que serven para contener o servir alimentos.
definition: Vasijas hondas de diferentes tamaños y formas, y generalmente con una cubierta; usadas para servir sopas, salsas, estofados u otras comidas.
definition: Atuells profunds de diferents grandàries i formes, i generalment amb una coberta; usades per a servir sopes, salses, estofats o altres menjars. @ca
definition: Deep vessels of varying size and shape, and usually having a cover; used for serving soup, sauce, stew, or other such foods. @en
in scheme: Objetos
preferred label: Tureen @en

Grupo de elementos que serven para contener o servir alimentos.
type: Concept
narrower: Sopera
preferred label: Contenidors per servir i consumir aliments @ca
preferred label: Containers for use in a kitchen, or for cooking. @en