Actividades
type: ConceptScheme
preferred label: Activitats @ca
preferred label: Activities @en

Tejido
type: Concept
broader: Procesos y técnicas de fabricación de objetos
definition: Del part. de tejer. Proceso de hacer un tejido, entrelazando uno o varios materiales.
definition: Del part. de teixir. Procés de fer un teixit, entrellaçant un o diversos materials. @ca
definition: The process of weaving a fabric by interweaving one or more materials. @en
in scheme: Actividades
preferred label: Teixit @ca
preferred label: Weaving (technique) @en

Procesos y técnicas de fabricación de objetos
type: Concept
narrower: Tejido
preferred label: Processos i tècniques de fabricació d'objectes @ca
preferred label: Processes and techniques for the manufacture of objects @en