Objetos
type: ConceptScheme
preferred label: Objectes @ca
preferred label: Objects @en

Vasija
type: Concept
alternative label: atuell @ca
broader: Contenedores por forma
definition: Del dim. del lat. vas 'vaso', 'vasija', 'vajilla'. Recipientes diseñados para servir como receptáculos para líquidos u otras sustancias, generalmente aquellos de sección circular y hechos de algún material resistente de uso doméstico. Es también una pieza cóncava y pequeña, de barro u otra materia y de forma común u ordinaria, que sirve para contener especialmente líquidos o cosas destinadas a la alimentación.
definition: Recipients dissenyats per a servir com a receptacles per a líquids o altres substàncies, generalment aquells de secció circular i fets de qualsevol material resistent d'ús domèstic. És també una peça còncava i xicoteta, de fang o una altra matèria i de manera comuna o ordinària, que serveix per a contindre especialment líquids o coses destinades a l'alimentació. @ca
definition: Containers designed to serve as receptacles for liquids or other substances, generally those of circular cross-section and made of some strong material of domestic use. It is also a small, concave piece, made of earthenware or other material and of common or ordinary shape, which serves to contain especially liquids or things intended for food. @en
in scheme: Objetos
narrower: Botella
narrower: Urna
preferred label: Atifell @ca
preferred label: Pot @en

Contenedores por forma
type: Concept
narrower: Vasija
preferred label: Contenidors per forma @ca
preferred label: Containers by form @en

Botella
type: Concept
broader: Vasija
preferred label: Bottle @en

Urna
type: Concept
broader: Vasija
preferred label: Urn @en