Objetos
type: ConceptScheme
preferred label: Objectes @ca
preferred label: Objects @en

Cajonera
type: Concept
broader: Componentes del mobiliario
definition: De cajón. Cuerpo de cajones, que se alberga en el interior de un mueble.
definition: De calaix. Cos de calaixos que es troba a linterior dun moble. @ca
definition: A piece of furniture consisting of a frame, often on short legs, containing a set of drawers @en
in scheme: Objetos
preferred label: Calaixera @ca
preferred label: Chest of drawers @en

Componentes del mobiliario
type: Concept
narrower: Cajonera
preferred label: Components del mobiliari @ca
preferred label: Furnishings components @en