Actividades
type: ConceptScheme
preferred label: Activitats @ca
preferred label: Activities @en

Aglomerado
type: Concept
broader: Procesos y técnicas sobre madera
definition: Del part. de aglomerar. Técnica de soldadura que consiste en aplicar calor al metal por debajo de su punto de fusión de modo que las partículas se unan en una masa sólida sin licuación. Se utiliza con frecuencia para crear o decorar la cerámica, o para trabajar o mejorar las propiedades mecánicas o físicas de metal.
definition: Tècnica de soldadura que consisteix a aplicar calor al metall per sota del seu punt de fusió de manera que les partícules s'uneixen en una massa sòlida sense liquació. S'utilitza amb freqüència per a crear o decorar la ceràmica, o per a treballar o millorar les propietats mecàniques o físiques de metall. @ca
definition: Welding technique that consists of heating the metal below its melting point so that the particles merge into a no liquefaction solid mass. It is often used to create or decorate ceramics, or to work or improve the mechanical or physical metal properties. @en
in scheme: Actividades
narrower: Tablero de fibra
narrower: OSB
narrower: DM
preferred label: Aglomerat @ca
preferred label: Agglomeration @en

Procesos y técnicas sobre madera
type: Concept
narrower: Aglomerado
preferred label: Processos i tècniques sobre fusta @ca
preferred label: Processes and techniques for woodworking @en

Tablero de fibra
type: Concept
broader: Aglomerado
preferred label: Tauler de fibra @ca
preferred label: Fibreboard @en

OSB
type: Concept
broader: Aglomerado

DM
type: Concept
broader: Aglomerado
preferred label: MD Fibreboard @en