Objetos
type: ConceptScheme
preferred label: Objectes @ca
preferred label: Objects @en

Vehículo
type: Concept
broader: Juguete por forma
definition: Del lat. vehic?lum. Objeto con forma de medio de transporte de personas o cosas que sirve para jugar.
definition: Del ll. vehic?lum, íd., der. de veh?re portar a sobre; transportar 1a font: 1864, DLab. Objecte amb forma de mitjà de transport de persones o coses que serveix per a jugar. @ca
definition: An object in the form of a means of transporting people or things used for playing. @en
in scheme: Objetos
narrower: Tren
narrower: Camión
narrower: Moto
narrower: Coche
preferred label: Vehicle @ca

Juguete por forma
type: Concept
narrower: Vehículo
preferred label: Joguet per forma @ca
preferred label: Toys by form @en

Tren
type: Concept
broader: Vehículo
preferred label: Train @en

Camión
type: Concept
broader: Vehículo
preferred label: Camió @ca
preferred label: Truck @en

Moto
type: Concept
broader: Vehículo
preferred label: Motorbike @en

Coche
type: Concept
broader: Vehículo
preferred label: Cotxe @ca
preferred label: Car @en