Materiales
type: ConceptScheme
preferred label: Materials @ca

Roble
type: Concept
alternative label: madera de roble
alternative label: fusta de roure @ca
alternative label: Flemish laburnum @en
broader: Madera dura
definition: De robre. Árbol de la familia de las fagáceas, que tiene por lo común de 15 a 20 m de altura y llega a veces hasta 40, con tronco grueso, grandes ramas tortuosas y hojas casi sentadas, trasovadas, lampiñas y de margen lobulado, que da flores de color verde amarillento en amentos axilares y fruto en bellotas pedunculadas y amargas, y cuya madera, dura, compacta y de color pardo amarillento, es muy apreciada para construcciones. Por extensión madera del roble. En mobiliario se ha usado tradicionalmente en macizo en el oeste de Europa: Inglaterra, Países Bajos y Francia, principalmente. En esta última es típica de las armaduras del mobiliario chapeado. En Inglaterra la erudición tradicional denomina
definition: Del ll. r?bur, r?b?ris roure; força, robustesa. Nom donat a les espècies caducifòlies del gènere Quercus, de la família de les fagàcies, formades per arbres monoics, de fulles sinuades i flors femenines en grups petits i fruits en gla. En mobiliari s'ha usat tradicionalment en massís en l'oest d'Europa: Anglaterra, Països Baixos i França, principalment. En esta última és típica de les armadures del mobiliari xapat. A Anglaterra l'erudició tradicional denomina "Edad de roble" al moble tradicional del Renaixement i del Barroc. Els primitius flamencs, així com l'escola francesa i portuguesa, van utilitzar molt la fusta de roure com a suport de la pintura, especialment, quan es tractava d'una sola peça. @ca
definition: Old English ?c; related to Old Norse eik, Old High German eih, Latin aesculus. An oak or an oak tree is a large tree that often grows in woods and forests and has strong, hard wood. In furniture, it has traditionally been used in solid wood in Western Europe, mainly in England, the Netherlands and France. In the latter it is typical of veneered furniture frames. In England, traditional English scholarship calls the traditional furniture of the Renaissance and Baroque periods @en
in scheme: Materiales
preferred label: Roure @ca
preferred label: Oak @en

Madera dura
type: Concept
narrower: Roble
preferred label: Fusta dura @ca
preferred label: Hardwood @en