Objetos
type: ConceptScheme
preferred label: Objectes @ca
preferred label: Objects @en

Barrote
type: Concept
broader: Componentes del mobiliario
definition: Una de una serie de delgadas varillas torneadas puestas en filas verticales para llenar áreas abiertas tales como respaldos de silla.
definition: Una d'una sèrie de primes varetes tornejades posades en files verticals per a omplir àrees obertes com ara respatlers de cadira. @ca
definition: One of a series of slender turned rods set in vertical rows to fill open areas such as chair backs. @en
in scheme: Objetos
preferred label: Barrot @ca
preferred label: Spindle @en

Componentes del mobiliario
type: Concept
narrower: Barrote
preferred label: Components del mobiliari @ca
preferred label: Furnishings components @en