Actividades
type: ConceptScheme
preferred label: Activitats @ca
preferred label: Activities @en

Emplomado
type: Concept
broader: Procesos y técnicas del vidrio
definition: De emplomar. Técnica de unión en la que se emplea plomo derretido para afianzar los distintos elementos. El uso del plomo derretido tuvo cierta importancia en las técnicas de construcción antiguas como grapas o anclas de diversas secciones para afianzar los sillares en las paredes o las partes de las columnas y pilares. El emplomado se ha empleado también en la realización de vidrieras donde las distintas piezas (de colores y formas) de vidrio se unían y se montaban en un armazón de plomo, formando la composición decorativa
definition: Tècnica d'unió en la qual s'empra plom fos per a afermar els diferents elements. L'ús del plom fos va tindre una certa importància en les tècniques de construcció antigues com a grapes o ancores de diverses seccions per a afermar els carreus en les parets o les parts de les columnes i pilars. L'emplomat s'ha emprat també en la realització de vidrieres on les diferents peces (de colors i formes) de vidre s'unien i es muntaven en una armadura de plom, formant la composició decorativa @ca
definition: A joining technique in which molten lead is used to secure the different elements. The use of molten lead was of some importance in ancient building techniques such as staples or anchors of various sections to secure ashlars to walls or parts of columns and pillars. Lead was also used in the production of stained-glass windows, where different pieces (of different colours and shapes) of glass were joined together and mounted on a lead frame, forming the decorative composition. @en
in scheme: Actividades
preferred label: Emplomat @ca
preferred label: Leading @en

Procesos y técnicas del vidrio
type: Concept
narrower: Emplomado
preferred label: Processos i tècniques de vidre @ca
preferred label: Glass working techniques and processes @en