Objetos
type: ConceptScheme
preferred label: Objectes @ca
preferred label: Objects @en

Muñeca personaje
type: Concept
broader: Muñeca
definition: Muñecas hechas a semejanza de personas reales específicas o personajes de ficción humanos o humanoides; use "juguete de personaje" para la categoría más amplia que incluye además, figuras de animales.
definition: Nines fetes a semblança de persones reals específiques o personatges de ficció humans o humanoides; use "joguet de personatge" per a la categoria més àmplia que inclou a més, figures d'animals. @ca
definition: Dolls made in the likeness of specific real people or human or humanoid fictional characters; use "character toys" for the broader category that includes these plus animal figures. @en
in scheme: Objetos
preferred label: Nina personatge @ca
preferred label: Character doll @en

Muñeca
type: Concept
narrower: Muñeca personaje
preferred label: Nina @ca
preferred label: Doll @en