Objetos
type: ConceptScheme
preferred label: Objectes @ca
preferred label: Objects @en

Caja de tabaco
type: Concept
alternative label: Caja para tabaco
alternative label: Caixa per a tabac @ca
broader: Contenedor relativo al tabaco
definition: Pequeñas cajas usadas para llevar tabaco de fumar o mascar, especialmente aquellas con cubiertas ajustables separadas.
definition: Boxes used for storing or carrying smoking or chewing tobacco; the covers may be unattached and fitted or hinged. @en
in scheme: Objetos
preferred label: Caixa de tabac @ca
preferred label: Tobacco box @en

Contenedor relativo al tabaco
type: Concept
narrower: Caja de tabaco
preferred label: Contenidors relatius al tabac @ca
preferred label: Tobacco-related containers @en