Actividades
type: ConceptScheme
preferred label: Activitats @ca
preferred label: Activities @en

Serigrafiado
type: Concept
alternative label: serigrafía
alternative label: serigrafia @ca
broader: Procesos y técnicas de formación de imágenes
definition: Técnica de impresión por estarcido en la que la tinta o pintura pasan al soporte a través de una fina malla, por lo general de seda, con un diseño que se forma enmascarando determinadas zonas.
definition: Tècnica d'impressió per estergit en la qual la tinta o pintura passen al suport a través d'una fina malla, en general de seda, amb un disseny que es forma emmascarant determinades zones. @ca
definition: Stencil technique of printing in which ink or dye is forced through a mesh, traditionally silk, on which a design has been formed by stopping out certain areas. @en
in scheme: Actividades
preferred label: Serigrafiat @ca
preferred label: Screen printing @en

Procesos y técnicas de formación de imágenes
type: Concept
narrower: Serigrafiado
preferred label: Processos i tècniques de formació d'imatges @ca
preferred label: Image-making processes and techniques @en