Actividades
type: ConceptScheme
preferred label: Activitats @ca
preferred label: Activities @en

Vidrio coloreado
type: Concept
broader: Procesos y técnicas del vidrio
definition: Vidrio creado a partir de la adición de óxidos metálicos durante su fundición.
definition: Vidre creat a partir de l'addició d'òxids metàl·lics durant la seua fosa. @ca
definition: A piece of glass created as a result of the addition of metal oxides during its melting. @en
in scheme: Actividades
preferred label: Vidre de color @ca
preferred label: Coloured glass @en

Procesos y técnicas del vidrio
type: Concept
narrower: Vidrio coloreado
preferred label: Processos i tècniques de vidre @ca
preferred label: Glass working techniques and processes @en