Actividades
type: ConceptScheme
preferred label: Activitats @ca
preferred label: Activities @en

Torneado
type: Concept
broader: Procesos y técnicas de fabricación de objetos
definition: Técnica que consiste en dar forma a un objeto empleando un torno manual o mecánico, para obtener una pieza de sección circular o en forma de esfera. El torno hace girar la pieza sujeta en uno de sus extremos, mientras una o varias herramientas de corte perfilan la superficie del objeto. Se ha utilizado para crear piezas de muebles en un principio manualmente y más adelante en la fabricación de piezas en serie.
definition: De tornejar. Tècnica que consisteix a donar forma a un objecte emprant un torn manual o mecànic, per a obtindre una peça de secció circular o en forma d'esfera. El torn fa girar la peça subjecta en un dels seus extrems, mentre una o diverses eines de tall perfilen la superfície de l'objecte. S'ha utilitzat per a crear peces de mobles al principi manualment i més endavant en la fabricació de peces en sèrie. @ca
definition: n. turn, -ing. A technique consisting of shaping an object using a manual or mechanical lathe to obtain a circular or sphere-shaped part. The lathe rotates the workpiece held at one end while one or more cutting tools shape the objects surface. It was initially used to manually create furniture parts and later in their mass-production. @en
in scheme: Actividades
preferred label: Tornejat @ca
preferred label: Turning @en

Procesos y técnicas de fabricación de objetos
type: Concept
narrower: Torneado
preferred label: Processos i tècniques de fabricació d'objectes @ca
preferred label: Processes and techniques for the manufacture of objects @en