Objetos
type: ConceptScheme
preferred label: Objectes @ca
preferred label: Objects @en

Sofá Tuxedo
type: Concept
preferred label: Tuxedo
alternative label: tuxedo sofa @en
broader: Sofá
definition: El sofá Tuxedo es conocido por su forma geométrica y cuadrada. Se trata de un sofá acolchado con brazos tapizados, rectos o ligeramente curvados hacia fuera, a la misma altura que el respaldo. Tiene su origen en los últimos años de la década de 1920 y su nombre, al igual que el traje, deriva del Tuxedo Park de Nueva York. Es un producto del modernismo neoyorquino de los años 20. Los brazos tienen la misma altura que la espalda, y el efecto general es inmaculado y moderno. Los brazos y el respaldo están nivelados, y la forma angular favorece una posición sentada erguida. Sin embargo, resulta cómodo gracias al suave cojín del asiento acolchado en fibra. Caracterizado por sus líneas limpias, este estilo es uno de los más elegidos y, en lugar de llamar la atención por sus elaboradas características, lo hace por su fuerte estética visual.
definition: El sofà Tuxedo és conegut per la seua forma geomètrica i quadrada. Es tracta d'un sofà embuatat amb braços entapissats, rectes o lleugerament corbats cap a fora, a la mateixa altura que el suport. Té el seu origen en els últims anys de la dècada de 1920 i el seu nom, igual que el vestit, deriva del Tuxedo Park de Nova York. És un producte del modernisme novaiorqués dels anys 20. Els braços tenen la mateixa altura que l'esquena, i l'efecte general és immaculat i modern. Els braços i el respatler estan anivellats, i la forma angular afavoreix una posició asseguda alçada. No obstant això, resulta còmode gràcies al suau coixí del seient embuatat en fibra. Caracteritzat per les seues línies netes, aquest estil és un dels més triats i, en lloc de cridar l'atenció per les seues elaborades característiques, ho fa pel seu fort estètica visual. @ca
definition: The Tuxedo sofa is known for its boxy, geometric shape. It is an overstuffed sofa with upholstered arms, either straight or curving slightly outward, at the same height as the back. It originates from the late 1920s and its name, like the suit, derives from Tuxedo Park in New York. It is a product of the 20s New York Modernism. The arms are the same height as the back, and the overall effect is immaculate and modern. The arms and back are levels, and the angular shape encourages an upright sitting position. However, its comfortable thanks to the smooth, fiber-padded bench-style seat cushion. Characterized by clean lines, the style is one of the slickest you could choose and instead of drawing attention due to elaborate features, it draws attention thanks to its strong visual aesthetic. @en
in scheme: Objetos
preferred label: Sofà Tuxedo @ca

Sofá
type: Concept
narrower: Sofá Tuxedo
preferred label: Sofà @ca
preferred label: Sofa @en