Objetos
type: ConceptScheme
preferred label: Objectes @ca
preferred label: Objects @en

Silla 14
type: Concept
alternative label: Silla Thonet
alternative label: Cadira Thonet @ca
alternative label: Thonet chair @en
broader: Silla por forma
definition: Silla creada por la compañía Thonet. También conocida con el nombre de bistro o silla Thonet (en honor a su creador), fue diseñada por él mismo Michael Thonet en 1854, usando la técnica del curvado de madera al vapor. La número 14 está hecha de seis piezas de madera curvada al vapor, diez tornillos y dos tuercas. Las partes de madera fueron hechas con listones de madera de haya calentados a 100 °C, prensadas en moldes de hierro fundido y dejándolas secar a una temperatura de alrededor de 70 °C durante 20 horas. Las sillas pueden ser producidas en masa por trabajadores no cualificados y desensamblada para ahorrar espacio durante el transporte. Conocida como silla n.º 14 porque aparece así catálogo de muebles. Su precio asequible y diseño simple la convirtió en uno de los modelos de sillas más vendidos de la historia y representa uno de los éxitos más colosales de la historia, se fabricaron casi 45 millones de este modelo, convirtiéndose en un clásico del diseño.
definition: Silla creada per la companyia Thonet. També coneguda amb el nom de bistro o cadira Thonet (en honor al seu creador), va ser dissenyada per ell mateix Michael Thonet en 1854, usant la tècnica del corbat de fusta al vapor. La número 14 està feta de sis peces de fusta corbada al vapor, deu caragols i dues rosques. Les parts de fusta van ser fetes amb llistons de fusta de faig calfats a 100 °C, premsades en motles de ferro colat i deixant-les assecar a una temperatura d'al voltant de 70 °C durant 20 hores. Les cadires poden ser produïdes en massa per treballadors no qualificats i desencadellada per a estalviar espai durant el transport. Coneguda com a cadira núm. 14 perquè apareix així catàleg de mobles. El seu preu assequible i disseny simple la va convertir en un dels models de cadires més venuts de la història i representa un dels èxits més colossals de la història, es van fabricar quasi 45 milions d'aquest model, convertint-se en un clàssic del disseny. @ca
definition: Chair created by the Thonet company. Also known by the name of bistro or Thonet chair (in honour of its creator), it was designed by Michael Thonet himself in 1854, using the technique of steam bending wood. Number 14 is made of six pieces of steam-bent wood, ten screws and two nuts. The wooden parts were made from beechwood strips heated to 100 °C, pressed into cast-iron moulds and left to dry at a temperature of about 70 °C for 20 hours. The chairs can be mass-produced by unskilled workers and disassembled to save space during transport. Known as chair no. 14 because it appears like this in the furniture catalogue. Its affordable price and simple design made it one of the best-selling chair models in history and represents one of the most colossal successes in history, almost 45 million of this model were manufactured, making it a classic of design. @en
in scheme: Objetos
preferred label: Cadira 14 @ca
preferred label: No. 14 chair @en

Silla por forma
type: Concept
narrower: Silla 14
preferred label: Cadira per forma @ca
preferred label: Chairs by form @en