Objetos
type: ConceptScheme
preferred label: Objectes @ca
preferred label: Objects @en

Flexo
type: Concept
broader: Lámpara de escritorio
definition: Del lat. flexus 'curvado'. Lámparas usadas por arquitectos para iluminar un área de trabajo, y que por lo general utilizan una combinación de bombillas incandescentes y fluorescentes.
definition: Llums usats per arquitectes per a il·luminar una àrea de treball, i que en general utilitzen una combinació de bombetes incandescents i fluorescents. @ca
definition: Lamps for use by architects to illuminate a work area, and which usually use a combination of incandescent and fluorescent bulbs. @en
in scheme: Objetos
preferred label: Architects' lamp @en

Lámpara de escritorio
type: Concept
narrower: Flexo
preferred label: Làmpara d'escriptori @ca