Actividades
type: ConceptScheme
preferred label: Activitats @ca
preferred label: Activities @en

Unión
type: Concept
broader: Procesos y técnicas de unión y adhesión
definition: n. Generally, constructing or composing a whole object or component by putting parts together; specifically refers to the construction of light forms of woodwork, including furniture constructed with dovetail or other joints, and features such as doors or staircases in buildings. @en
definition: del ll. unio, -?nis, íd. En general, la construcció o composició dun objecte complet o component, posant les peces juntes; es refereix específicament a la construcció de formes lleugeres de fusta, inclosos mobles construïts amb cua d'oreneta o d'altres articulacions, i característiques com ara portes o escales en els edificis. @ca
definition: Del lat. tardío unio, -?nis. En general, la construcción o componer un objeto completo o componente, poniendo las piezas juntas; se refiere específicamente a la construcción de formas livianas de madera, incluidos muebles construidos con cola de milano o de otras articulaciones, y características tales como puertas o escaleras en los edificios.
in scheme: Actividades
narrower: Atado
narrower: Atornillado
narrower: Clavado
narrower: Empalme
narrower: Ensamblado
narrower: Engrapado
narrower: Remachado
preferred label: Join @en
preferred label: Unió @ca

Procesos y técnicas de unión y adhesión
type: Concept
narrower: Unión
preferred label: Processos i tècniques d'unió i adhesió @ca
preferred label: Additive and joining processes and techniques @en

Atado
type: Concept
broader: Unión
preferred label: Lligat @ca
preferred label: Tying @en

Atornillado
type: Concept
broader: Unión
preferred label: Caragolat @ca
preferred label: Screwing @en

Clavado
type: Concept
broader: Unión
preferred label: Clavat @ca
preferred label: Nailing @en

Empalme
type: Concept
broader: Unión
preferred label: Empalmament @ca
preferred label: Joinery (wood technic) @en

Ensamblado
type: Concept
broader: Unión
preferred label: Encaix (tècnica) @ca
preferred label: Joinery @en

Engrapado
type: Concept
broader: Unión
preferred label: Grapat @ca
preferred label: Stapling @en

Remachado
type: Concept
broader: Unión
preferred label: Reblat @ca
preferred label: Riveting @en