Objetos
type: ConceptScheme
preferred label: Objectes @ca
preferred label: Objects @en

Mesa por forma
type: Concept
broader: Mesa
definition: Jerarquía que distingue los tipos de mesa según la forma con la que hayan sido diseñadas.
definition: Jerarquia que distingeix els tipus de taula segons la forma amb la qual hagen sigut dissenyats. @ca
definition: Hierarchy distinguishing between types of tables according to the form in which they are designed. @en
in scheme: Objetos
narrower: Consola
preferred label: Taula per forma @ca
preferred label: Table by form @en

Mesa
type: Concept
narrower: Mesa por forma
preferred label: Taula @ca
preferred label: Table @en

Consola
type: Concept
broader: Mesa por forma
preferred label: Console table @en