Objetos
type: ConceptScheme
preferred label: Objectes @ca
preferred label: Objects @en

Vaso
type: Concept
broader: Grupo de elementos que serven para contener o servir alimentos.
definition: Del latín, vasum. Pieza o vasija cóncava de diferentes formas y tamaños pero que generalmente son más altas que anchas y a menudo cilíndricas. Usadas principalmente para contener líquidos, sostener flores o para propósitos ornamentales.
definition: Peça o atuell còncau de diferents formes i grandàries però que generalment són més altes que amples i sovint cilíndriques. Usades principalment per a contindre líquids, sostindre flors o per a propòsits ornamentals. @ca
definition: A concave piece or vessel of various shapes and sizes, but generally taller than wide and often cylindrical in shape. Used mainly for the containment of liquids, the display of flowers or for ornamental purposes. @en
in scheme: Objetos
preferred label: Got @ca
preferred label: Vase @en

Grupo de elementos que serven para contener o servir alimentos.
type: Concept
narrower: Vaso
preferred label: Contenidors per servir i consumir aliments @ca
preferred label: Containers for use in a kitchen, or for cooking. @en