Actividades
type: ConceptScheme
preferred label: Activitats @ca
preferred label: Activities @en

Madera curvada
type: Concept
broader: Procesos y técnicas sobre madera
definition: Madera que ha sido sometida a la acción del vapor caliente con el propósito de hacerla maleable y de sección curva.
definition: Fusta que ha estat sotmesa a l'acció del vapor calent amb el propòsit de fer-la mal·leable i de secció corba. @ca
definition: Wood that has been exposed to the effect of heat steam in order to make it flexible and curved in section. @en
in scheme: Actividades
preferred label: Fusta corbada @ca
preferred label: Bentwood @en

Procesos y técnicas sobre madera
type: Concept
narrower: Madera curvada
preferred label: Processos i tècniques sobre fusta @ca
preferred label: Processes and techniques for woodworking @en