Actividades
type: ConceptScheme
preferred label: Activitats @ca
preferred label: Activities @en

Grabado
type: Concept
broader: Procesos y técnicas para marcar superficies
definition: Proceso en el que se marca una pieza de diferentes materiales para crear una decoración en ella. Hay muchos tipos de grabados dependiendo de la técnica y el material.
definition: Procés en el qual es marca una peça de diferents materials per a crear una decoració en ella. Hi ha molts tipus de gravats depenent de la tècnica i el material. @ca
definition: The process of marking a piece of different materials to create a decoration on it. There are many types of engraving depending on the technique and material. @en
in scheme: Actividades
preferred label: Gravat @ca
preferred label: Engraving @en

Procesos y técnicas para marcar superficies
type: Concept
narrower: Grabado
preferred label: Processos i tècniques per a marcar superfícies @ca
preferred label: Surface marking processes and techniques @en