Actividades
type: ConceptScheme
preferred label: Activitats @ca
preferred label: Activities @en

Acristalado
type: Concept
broader: Revestido
definition: Cubrir con una capa delgada, usualmente lustrosa, algunas veces transparente, incluye la aplicación de pintura transparente coloreada sobre areas de otras pinturas para alterar la apariencia del color.
definition: Cobrir amb una capa prima, usualment llustrosa, algunes vegades transparent, inclou l'aplicació de pintura transparent acolorida sobre *areas d'altres pintures per a alterar l'aparença del color. @ca
definition: Overlaying or covering with a smooth and lustrous coating, or polishing and burnishing to create a smooth, shiney surface. To refer specifically to glazing paintings, use the narrower concept "glazing (painting technique)." To refer specifically to glazing ceramics, use the narrower concept "pottery glazing (process)." @en
in scheme: Actividades
preferred label: Envidrat @ca
preferred label: Glazing @en

Revestido
type: Concept
narrower: Acristalado
preferred label: Revestit @ca
preferred label: Coating @en