Objetos
type: ConceptScheme
preferred label: Objectes @ca
preferred label: Objects @en

Juguete de arena
type: Concept
broader: Juguete por funcionamiento
definition: Úsese para juguetes con partes mecánicas o móviles que se ponen en marcha cuando la arena pasa a través de ellos.
definition: Use's per a joguets amb parts mecàniques o mòbils que es posen en marxa quan l'arena passa a través d'ells. @ca
definition: Toys with moving or mechanical parts set in motion as sand passes through them. @en
in scheme: Objetos
preferred label: Joguet d'arena @ca
preferred label: Sand toy @en

Juguete por funcionamiento
type: Concept
narrower: Juguete de arena
preferred label: Joguets per funcionament @ca
preferred label: Toys by mode of operation @en