Objetos
type: ConceptScheme
preferred label: Objectes @ca
preferred label: Objects @en

Cenicero
type: Concept
broader: Contenedor relativo al tabaco
definition: Recipiente donde los fumadores dejan las cenizas de tabaco, fabricados en una gran variedad de tamaños y diseños.
definition: Recipient on els fumadors deixen les cendres de tabac, fabricats en una gran varietat de grandàries i dissenys. @ca
definition: Containers in which smokers dispose of tobacco ash, manufactured in a variety of sizes and designs. @en
in scheme: Objetos
preferred label: Cendrer @ca
preferred label: Ashtray @en

Contenedor relativo al tabaco
type: Concept
narrower: Cenicero
preferred label: Contenidors relatius al tabac @ca
preferred label: Tobacco-related containers @en