Actividades
type: ConceptScheme
preferred label: Activitats @ca
preferred label: Activities @en

Barniz de protección
type: Concept
broader: Barnizado
definition: Barniz que sirve para cubrir áreas seleccionadas de una superficie para impedir que se actúe sobre ellas, como en aguafuertes o serigrafías.
definition: Vernís que servix per a cobrir àrees seleccionades d'una superfície per a impedir que s'actue sobre elles, com en aiguaforts o serigrafies. @ca
definition: A varnish used to cover selected areas of a surface to prevent them from being acted upon, as in etchings or silkscreen printing. @en
in scheme: Actividades
preferred label: Vernís de protecció @ca
preferred label: Stopping out @en

Barnizado
type: Concept
narrower: Barniz de protección
preferred label: Envernissat @ca
preferred label: Varnishing @en