Objetos
type: ConceptScheme
preferred label: Objectes @ca
preferred label: Objects @en

Vajilla
type: Concept
broader: Conjunto
definition: Conjunto de platos, fuentes, vasos, tazas, cubiertos, etc., de porcelana y cristalería que se destinan al servicio de la mesa.
definition: Conjunt de plats, fonts, gots, tasses, coberts, etc., de porcellana i cristalleria que es destinen al servei de la taula. @ca
definition: A set of porcelain or glass plates, bowls, glasses, cups, cutlery, etc., intended for table service. @en
in scheme: Objetos
preferred label: Vaixella @ca
preferred label: Dinnerware @en

Conjunto
type: Concept
narrower: Vajilla
preferred label: Conjunt @ca
preferred label: Set @en