Objetos
type: ConceptScheme
preferred label: Objectes @ca
preferred label: Objects @en

Azucarero
type: Concept
broader: Grupo de elementos que serven para contener o servir alimentos.
definition: Bols de diversas formas para principalmente guardar y servir azúcar; hechos como una pieza individual, para hacer juego con una cremera, o como parte de un servicio de té o café.
definition: Bols de diverses formes per a principalment guardar i servir sucre; fets com una peça individual, per a fer joc amb una cremera, o com a part d'un servici de te o café. @ca
definition: Bowls of varying form but usually lidded, intended primarily for holding and serving sugar; made as an individual piece, to match a creamer, or as part of a tea or coffee service. @en
in scheme: Objetos
preferred label: Sucrer @ca

Grupo de elementos que serven para contener o servir alimentos.
type: Concept
narrower: Azucarero
preferred label: Contenidors per servir i consumir aliments @ca
preferred label: Containers for use in a kitchen, or for cooking. @en